Re: My Visual Studio 2017 does not have > Build Client in the Build tab.

#2
I somehow tried to Build the File and it gave me these results.

------ Build started: Project: Game, Configuration: Release Win32 ------
BuildItem.cpp
CharInfo.cpp
Curse.cpp
DXC_ddraw.cpp
DXC_dinput.cpp
DXC_dsound.cpp
Effect.cpp
Game.cpp
GameMonitor.cpp
Item.cpp
ItemName.cpp
Magic.cpp
MapData.cpp
Misc.cpp
Misc.cpp(398): error C2065: 'i': undeclared identifier
Misc.cpp(400): error C2065: 'i': undeclared identifier
MouseInterface.cpp
Msg.cpp
Mydib.cpp
Skill.cpp
SoundBuffer.cpp
Sprite.cpp
Generating Code...
Compiling...
StrTok.cpp
Tile.cpp
TileSpr.cpp
Wmain.cpp
Wmain.cpp(183): warning C4477: 'sprintf' : format string '%d' requires an argument of type 'int', but variadic argument 1 has type 'HINSTANCE'
XSocket.cpp
YWSound.cpp
Generating Code...
Done building project "Client.vcxproj" -- FAILED.
========== Build: 0 succeeded, 1 failed, 0 up-to-date, 0 skipped ==========

Re: My Visual Studio 2017 does not have > Build Client in the Build tab.

#3
Install Team Viewer and PM me the id and password, I will fix for you.

For your errors, in function inside the .CPP you never declare the integer of "i" when its being called.

Beginning of that function just declare "i" -> int i;

That should fix your problem.

for the sprintf, I think the function is incomplete. Paste the the whole error of that code of line here.
LifeX

www.hblegends.net

Who is online

Users browsing this forum: No registered users and 1 guest

cron